Reaction Details
TargetReverse transcriptase/RNaseH
LigandBDBM50286546
Substrate/Competitorn/a
Meas. Tech.ChEMBL_196368 (CHEMBL806001)
IC50>300000±n/a nM
Citation Young, SDAmblard, MCBritcher, SFGrey, VETran, LOLumma, WCHuff, JRSchleif, WAEmini, EEO'Brien, JAPettibone, DJ 2-Heterocyclic indole-3-sulfones as inhibitors of HIV-1 reverse transcriptase Bioorg Med Chem Lett5:491-496 (1995)    Article
 
Reverse transcriptase/RNaseH
Name:Reverse transcriptase/RNaseH
Type:PROTEIN
Mol. Mass.:65229.15
Organism:Human immunodeficiency virus 1
Description:ChEMBL_1473730
Residue:566
BDBM50286546
NameBDBM50286546
Synonyms:4-(3-Benzenesulfonyl-5-chloro-1H-indol-2-yl)-4H-1lambda*4*-thiazol-2-ylamine | CHEMBL558604
TypeSmall organic molecule
Emp. Form.C17H12ClN3O2S2
Mol. Mass.389.879
SMILESNc1nc(cs1)-c1[nH]c2ccc(Cl)cc2c1S(=O)(=O)c1ccccc1