Reaction Details
TargetReverse transcriptase/RNaseH
LigandBDBM50286545
Substrate/Competitorn/a
Meas. Tech.ChEMBL_196368 (CHEMBL806001)
IC50>300000±n/a nM
Citation Young, SDAmblard, MCBritcher, SFGrey, VETran, LOLumma, WCHuff, JRSchleif, WAEmini, EEO'Brien, JAPettibone, DJ 2-Heterocyclic indole-3-sulfones as inhibitors of HIV-1 reverse transcriptase Bioorg Med Chem Lett5:491-496 (1995)    Article
 
Reverse transcriptase/RNaseH
Name:Reverse transcriptase/RNaseH
Type:PROTEIN
Mol. Mass.:65229.15
Organism:Human immunodeficiency virus 1
Description:ChEMBL_1473730
Residue:566
BDBM50286545
NameBDBM50286545
Synonyms:3-Benzenesulfonyl-5-chloro-2-(1H-imidazol-2-yl)-1H-indole | CHEMBL148371
TypeSmall organic molecule
Emp. Form.C17H12ClN3O2S
Mol. Mass.357.814
SMILESClc1ccc2[nH]c(-c3ncc[nH]3)c(c2c1)S(=O)(=O)c1ccccc1