Reaction Details
TargetGag-Pol polyprotein [489-587]
LigandBDBM50286542
Substrate/Competitorn/a
Meas. Tech.ChEBML_195356
IC50 17±n/a nM
Citation Young, SDAmblard, MCBritcher, SFGrey, VETran, LOLumma, WCHuff, JRSchleif, WAEmini, EEO'Brien, JAPettibone, DJ 2-Heterocyclic indole-3-sulfones as inhibitors of HIV-1 reverse transcriptase Bioorg Med Chem Lett5:491-496 (1995)    Article
 
Gag-Pol polyprotein [489-587]
Name:Gag-Pol polyprotein [489-587]
Type:Enzyme Subunit
Mol. Mass.:10781.16
Organism:Human immunodeficiency virus type 1
Description:P04585[489-587]
Residue:99
BDBM50286542
NameBDBM50286542
Synonyms:3-Benzenesulfonyl-5-chloro-2-(4,5-dihydro-thiazol-2-yl)-1H-indole | CHEMBL144742
TypeSmall organic molecule
Emp. Form.C17H13ClN2O2S2
Mol. Mass.376.88
SMILESClc1ccc2[nH]c(C3=NCCS3)c(c2c1)S(=O)(=O)c1ccccc1