Reaction Details
TargetGag-Pol polyprotein [489-587]
LigandBDBM50286551
Substrate/Competitorn/a
Meas. Tech.ChEBML_195356
IC50 8.1±n/a nM
Citation Young, SDAmblard, MCBritcher, SFGrey, VETran, LOLumma, WCHuff, JRSchleif, WAEmini, EEO'Brien, JAPettibone, DJ 2-Heterocyclic indole-3-sulfones as inhibitors of HIV-1 reverse transcriptase Bioorg Med Chem Lett5:491-496 (1995)    Article
 
Gag-Pol polyprotein [489-587]
Name:Gag-Pol polyprotein [489-587]
Type:Enzyme Subunit
Mol. Mass.:10781.16
Organism:Human immunodeficiency virus type 1
Description:P04585[489-587]
Residue:99
BDBM50286551
NameBDBM50286551
Synonyms:2-(3-Benzenesulfonyl-5-chloro-1H-indol-2-yl)-4,5,6,7-tetrahydro-1H-benzoimidazole | CHEMBL147790
TypeSmall organic molecule
Emp. Form.C21H18ClN3O2S
Mol. Mass.411.905
SMILESClc1ccc2[nH]c(-c3nc4CCCCc4[nH]3)c(c2c1)S(=O)(=O)c1ccccc1