Reaction Details
TargetGag-Pol polyprotein [489-587]
LigandBDBM50213827
Substrate/Competitorn/a
Meas. Tech.ChEMBL_159623 (CHEMBL881019)
IC50<0.250000±n/a nM
Citation Kaldor, SWAppelt, KFritz, JEHammond, MCrowell, TABaxter, AJHatch, SDWiskerchen, MMuesing, MA A systematic study of P1–P3 spanning sidechains for the inhibition of HIV-1 protease Bioorg Med Chem Lett5:715-720 (1995)    Article
 
Gag-Pol polyprotein [489-587]
Name:Gag-Pol polyprotein [489-587]
Type:Enzyme Subunit
Mol. Mass.:10781.16
Organism:Human immunodeficiency virus type 1
Description:P04585[489-587]
Residue:99
BDBM50213827
NameBDBM50213827
Synonyms:CHEMBL351834
TypeSmall organic molecule
Emp. Form.C42H52N6O5S
Mol. Mass.752.964
SMILES[H][C@]12CCCC[C@@]1([H])C[C@]([H])(N(C[C@@H](O)[C@H](CSc1ccc3ccccc3c1)NC(=O)[C@H](CC(N)=O)NC(=O)c1ccc3ccccc3n1)C2)C(=O)NC(C)(C)C