Reaction Details
TargetGag-Pol polyprotein [489-587]
LigandBDBM50286712
Substrate/Competitorn/a
Meas. Tech.ChEBML_157737
Ki 166±n/a nM
Citation Kalish, VJTatlock, JHDavies, JFKaldor, SWDressman, BAReich, SPino, MNyugen, DAppelt, KMusick, LWu, Bw Structure-based drug design of nonpeptidic P2 substituents for HIV-1 protease inhibitors Bioorg Med Chem Lett5:727-732 (1995)    Article
 
Gag-Pol polyprotein [489-587]
Name:Gag-Pol polyprotein [489-587]
Type:Enzyme Subunit
Mol. Mass.:10781.16
Organism:Human immunodeficiency virus type 1
Description:P04585[489-587]
Residue:99
BDBM50286712
NameBDBM50286712
Synonyms:2,3-Dihydro-1H-indole-4-carboxylic acid [(1R,2R)-3-(2-tert-butylcarbamoyl-phenyl)-2-hydroxy-1-(naphthalen-2-ylsulfanylmethyl)-propyl]-amide | CHEMBL349662
TypeSmall organic molecule
Emp. Form.C34H37N3O3S
Mol. Mass.567.741
SMILESCC(C)(C)NC(=O)c1ccccc1C[C@@H](O)[C@H](CSc1ccc2ccccc2c1)NC(=O)c1cccc2NCCc12