Reaction Details
TargetBile salt-activated lipase
LigandBDBM50286880
Substrate/Competitorn/a
Meas. Tech.ChEMBL_154778 (CHEMBL761498)
Ki 20000±n/a nM
Citation Lin, GLiu, HCTsai, YC Atropisomeric carbamoyl type inhibitors of pancreatic cholesterol esterase Bioorg Med Chem Lett6:43-46 (1996)    Article
 
Bile salt-activated lipase
Name:Bile salt-activated lipase
Type:PROTEIN
Mol. Mass.:65152.77
Organism:Bos taurus
Description:ChEMBL_154778
Residue:597
BDBM50286880
NameBDBM50286880
Synonyms:Butyric acid 2'-butylcarbamoyloxy-[1,1']binaphthalenyl-2-yl ester | CHEMBL139598
TypeSmall organic molecule
Emp. Form.C29H29NO4
Mol. Mass.455.5449
SMILESCCCCNC(=O)Oc1ccc2ccccc2c1-c1c(OC(=O)CCC)ccc2ccccc12