Reaction Details
TargetPolyunsaturated fatty acid 5-lipoxygenase
LigandBDBM22372
Substrate/Competitorn/a
Meas. Tech.ChEBML_4167
IC50 400±n/a nM
Citation Tait, BDDyer, RDAuerbach, BJBornemeier, DGuilds-Zamarka, LOxender, MRoth, BDTrivedi, BKCornicelli, JA Catechol based inhibitors of 15-lipoxygenase Bioorg Med Chem Lett6:93-96 (1996)    Article
 
Polyunsaturated fatty acid 5-lipoxygenase
Name:Polyunsaturated fatty acid 5-lipoxygenase
Type:PROTEIN
Mol. Mass.:78082.31
Organism:Rattus norvegicus
Description:ChEMBL_1432947
Residue:673
BDBM22372
NameBDBM22372
Synonyms:4-[(2R,3S)-4-(3,4-dihydroxyphenyl)-2,3-dimethylbutyl]benzene-1,2-diol CHEMBL313972 NDGA | Nordihydroguaiaretic Acid
TypeAntioxidant
Emp. Form.C18H22O4
Mol. Mass.302.3649
SMILESC[C@@H](Cc1ccc(O)c(O)c1)[C@H](C)Cc1ccc(O)c(O)c1