Reaction Details
TargetKappa-type opioid receptor
LigandBDBM50287332
Substrate/Competitorn/a
Meas. Tech.ChEBML_145384
IC50 1.5±n/a nM
Citation Hutchinson, IArcher, SHill, KPBidlack, JM Synthesis and opioid binding properties of 2-chloroacrylamido derivatives of 7,8-dihydromorphinans Bioorg Med Chem Lett6:1563-1566 (1996)    Article
 
Kappa-type opioid receptor
Name:Kappa-type opioid receptor
Type:G Protein-Coupled Receptor (GPCR)
Mol. Mass.:42648.76
Organism:Homo sapiens (Human)
Description:P41145
Residue:380
BDBM50287332
NameBDBM50287332
Synonyms:1N-[4-cyclopropylmethyl-10-hydroxy-(13R,14R)-12-oxa-4-azapentacyclo[9.6.1.01,13.05,17.07,18]octadeca-7(18),8,10-trien-14-yl]-2-chloroacrylamide | CHEMBL289426
TypeSmall organic molecule
Emp. Form.C23H27ClN2O3
Mol. Mass.414.925
SMILESOc1ccc2CC3C4CC[C@@H](NC(=O)C(Cl)=C)[C@@H]5Oc1c2C45CCN3CC1CC1