Reaction Details
TargetThromboxane-A synthase
LigandBDBM50000317
Substrate/Competitorn/a
Meas. Tech.ChEBML_209941
IC50 28±n/a nM
Citation Dickinson, RPDack, KNSteele, JTute, MS Thromboxane modulating agents. 2. Thromboxane receptor antagonists derived from the thromboxane synthase inhibitor dazmegrel. Bioorg Med Chem Lett6:1691-1696 (1996)    Article
 
Thromboxane-A synthase
Name:Thromboxane-A synthase
Type:Enzyme
Mol. Mass.:60524.67
Organism:Homo sapiens (Human)
Description:P24557
Residue:533
BDBM50000317
NameBDBM50000317
Synonyms:3-(3-Imidazol-1-ylmethyl-2-methyl-indol-1-yl)-propionic acid CHEMBL283656 UK-38485
TypeSmall organic molecule
Emp. Form.C16H17N3O2
Mol. Mass.283.3251
SMILESCc1c(Cn2ccnc2)c2ccccc2n1CCC(O)=O