Reaction Details
TargetNeuropeptide Y receptor type 1
LigandBDBM50287538
Substrate/Competitorn/a
Meas. Tech.ChEBML_144144
Ki 129±n/a nM
Citation Wright, JBolton, GCreswell, MDowning, DGeorgic, LHeffner, THodges, JMacKenzie, RWise, L 8-amino-6-(arylsulphonyl)-5-nitroquinolines: novel nonpeptide neuropeptide Y1 receptor antagonists Bioorg Med Chem Lett6:1809-1814 (1996)    Article
 
Neuropeptide Y receptor type 1
Name:Neuropeptide Y receptor type 1
Type:Enzyme Catalytic Domain
Mol. Mass.:44399.07
Organism:Homo sapiens (Human)
Description:NPY-Y1 NPY1R HUMAN::P25929
Residue:384
BDBM50287538
NameBDBM50287538
Synonyms:6-(2-Ethyl-benzenesulfonyl)-5-nitro-quinolin-8-ylamine | CHEMBL51611
TypeSmall organic molecule
Emp. Form.C17H15N3O4S
Mol. Mass.357.384
SMILESCCc1ccccc1S(=O)(=O)c1cc(N)c2ncccc2c1[N+]([O-])=O