Reaction Details
TargetNeprilysin
LigandBDBM50287691
Substrate/Competitorn/a
Meas. Tech.ChEBML_144623
Ki 14±n/a nM
Citation Beight, DWMehdi, SKoehl, JRFlynn, GA Synthesis of constrained thiorphan analogs as inhibitors of neutral endopeptidase Bioorg Med Chem Lett6:2053-2058 (1996)    Article
 
Neprilysin
Name:Neprilysin
Type:Protein
Mol. Mass.:85789.59
Organism:Rattus norvegicus (Rat)
Description:P07861
Residue:750
BDBM50287691
NameBDBM50287691
Synonyms:2-Mercaptomethyl-1,2,3,4-tetrahydro-naphthalene-2-carboxylic acid (benzo[1,3]dioxol-5-ylmethyl)-amide | CHEMBL61840
TypeSmall organic molecule
Emp. Form.C20H21NO3S
Mol. Mass.355.451
SMILESSCC1(CCc2ccccc2C1)C(=O)NCc1ccc2OCOc2c1