Reaction Details
TargetNeprilysin
LigandBDBM50287692
Substrate/Competitorn/a
Meas. Tech.ChEBML_144623
Ki 10±n/a nM
Citation Beight, DWMehdi, SKoehl, JRFlynn, GA Synthesis of constrained thiorphan analogs as inhibitors of neutral endopeptidase Bioorg Med Chem Lett6:2053-2058 (1996)    Article
 
Neprilysin
Name:Neprilysin
Type:Protein
Mol. Mass.:85789.59
Organism:Rattus norvegicus (Rat)
Description:P07861
Residue:750
BDBM50287692
NameBDBM50287692
Synonyms:CHEMBL431957 | [(2-Mercaptomethyl-indane-2-carbonyl)-amino]-acetic acid benzyl ester
TypeSmall organic molecule
Emp. Form.C20H21NO3S
Mol. Mass.355.451
SMILESSCC1(Cc2ccccc2C1)C(=O)NCC(=O)OCc1ccccc1