Reaction Details
TargetNeprilysin
LigandBDBM50287702
Substrate/Competitorn/a
Meas. Tech.ChEBML_144623
Ki 0.300000±n/a nM
Citation Beight, DWMehdi, SKoehl, JRFlynn, GA Synthesis of constrained thiorphan analogs as inhibitors of neutral endopeptidase Bioorg Med Chem Lett6:2053-2058 (1996)    Article
 
Neprilysin
Name:Neprilysin
Type:Protein
Mol. Mass.:85789.59
Organism:Rattus norvegicus (Rat)
Description:P07861
Residue:750
BDBM50287702
NameBDBM50287702
Synonyms:(S)-2-[(2-Mercaptomethyl-1,2,3,4-tetrahydro-naphthalene-2-carbonyl)-amino]-propionic acid benzyl ester | CHEMBL294536
TypeSmall organic molecule
Emp. Form.C22H25NO3S
Mol. Mass.383.504
SMILESC[C@H](NC(=O)C1(CS)CCc2ccccc2C1)C(=O)OCc1ccccc1