Reaction Details
TargetHistidinol dehydrogenase, chloroplastic
LigandBDBM50267972
Substrate/Competitorn/a
Meas. Tech.ChEMBL_923891 (CHEMBL3082926)
Ki 7.6±n/a nM
Citation Dancer, JEFord, MJHamilton, KKilkelly, MLindell, SDO'Mahony, MJSaville-Stones, EA Synthesis of potent inhibitors of histidinol dehydrogenase Bioorg Med Chem Lett6:2131-2136 (1996)    Article
 
Histidinol dehydrogenase, chloroplastic
Name:Histidinol dehydrogenase, chloroplastic
Type:PROTEIN
Mol. Mass.:50957.92
Organism:Brassica oleracea var. capitata
Description:EBI_100278
Residue:469
BDBM50267972
NameBDBM50267972
Synonyms:(S)-3-Amino-4-(1H-imidazol-4-yl)-1-phenyl-butan-2-one; dihydrochloride CHEMBL500316
TypeSmall organic molecule
Emp. Form.C13H15N3O
Mol. Mass.229.2777
SMILESN[C@@H](Cc1cnc[nH]1)C(=O)Cc1ccccc1