Reaction Details
TargetHistidinol dehydrogenase, chloroplastic
LigandBDBM50287735
Substrate/Competitorn/a
Meas. Tech.ChEMBL_923891 (CHEMBL3082926)
Ki 7.4±n/a nM
Citation Dancer, JEFord, MJHamilton, KKilkelly, MLindell, SDO'Mahony, MJSaville-Stones, EA Synthesis of potent inhibitors of histidinol dehydrogenase Bioorg Med Chem Lett6:2131-2136 (1996)    Article
 
Histidinol dehydrogenase, chloroplastic
Name:Histidinol dehydrogenase, chloroplastic
Type:PROTEIN
Mol. Mass.:50957.92
Organism:Brassica oleracea var. capitata
Description:EBI_100278
Residue:469
BDBM50287735
NameBDBM50287735
Synonyms:(S)-3-Amino-1-(3-amino-phenyl)-4-(1H-imidazol-4-yl)-butan-2-one; dihydrochloride | CHEMBL553052
TypeSmall organic molecule
Emp. Form.C13H16N4O
Mol. Mass.244.2923
SMILESN[C@@H](Cc1cnc[nH]1)C(=O)Cc1cccc(N)c1