Reaction Details
TargetBeta-3 adrenergic receptor
LigandBDBM50002133
Substrate/Competitorn/a
Meas. Tech.ChEMBL_39055 (CHEMBL652056)
Ki 960±n/a nM
Citation Fisher, LGSher, PMSkwish, SMichel, IMSeiler, SMDickinson, KE BMS-187257, a potent, selective, and novel heterocyclic β3 adrenergic receptor agonist Bioorg Med Chem Lett6:2253-2258 (1996)    Article
 
Beta-3 adrenergic receptor
Name:Beta-3 adrenergic receptor
Type:G Protein-Coupled Receptor (GPCR)
Mol. Mass.:43534.88
Organism:Homo sapiens (Human)
Description:n/a
Residue:408
BDBM50002133
NameBDBM50002133
Synonyms:(+/-)-2-(4-((R)-2-((R)-2-(3-chlorophenyl)-2-hydroxyethylamino)propyl)phenoxy)acetic acid (4-{2-[(R)-2-((R)-3-Chloro-phenyl)-2-hydroxy-ethylamino]-propyl}-phenoxy)-acetic acid (BRL 37,344)(4-{2-[2-(3-Chloro-phenyl)-2-hydroxy-ethylamino]-propyl}-phenoxy)-acetic acid 2-(4-((R)-2-((R)-2-(3-chlorophenyl)-2-hydroxyethylamino)propyl)phenoxy)acetic acid CHEMBL284782
TypeSmall organic molecule
Emp. Form.C19H22ClNO4
Mol. Mass.363.835
SMILESC[C@H](Cc1ccc(OCC(O)=O)cc1)NC[C@H](O)c1cccc(Cl)c1