Reaction Details
TargetBeta-2 adrenergic receptor
LigandBDBM50287796
Substrate/Competitorn/a
Meas. Tech.ChEBML_38465
Ki 2350±n/a nM
Citation Fisher, LGSher, PMSkwish, SMichel, IMSeiler, SMDickinson, KE BMS-187257, a potent, selective, and novel heterocyclic β3 adrenergic receptor agonist Bioorg Med Chem Lett6:2253-2258 (1996)    Article
 
Beta-2 adrenergic receptor
Name:Beta-2 adrenergic receptor
Type:n/a
Mol. Mass.:46461.69
Organism:Homo sapiens (Human)
Description:P07550
Residue:413
BDBM50287796
NameBDBM50287796
Synonyms:CHEMBL308150 {4-[2-((S)-2-Hydroxy-3-phenoxy-propylamino)-ethoxy]-phenoxy}-acetic acid
TypeSmall organic molecule
Emp. Form.C19H23NO6
Mol. Mass.361.389
SMILESO[C@@H](CNCCOc1ccc(OCC(O)=O)cc1)COc1ccccc1