Reaction Details
TargetNeuronal acetylcholine receptor subunit alpha-10
LigandBDBM50287814
Substrate/Competitorn/a
Meas. Tech.ChEBML_143222
Ki 5±n/a nM
Citation Elliott, RLKopecka, HGunn, DELin, NHGarvey, DSRyther, KBHolladay, MWAnderson, DJCampbell, JESullivan, JPBuckley, MJGunther, KLO'Neill, ABDecker, MWArnerić, SP 2-(Aryloxymethyl) azacyclic analogues as novel nicotinic acetylcholine receptor (nAChR) ligands Bioorg Med Chem Lett6:2283-2288 (1996)    Article
 
Neuronal acetylcholine receptor subunit alpha-10
Name:Neuronal acetylcholine receptor subunit alpha-10
Type:PROTEIN
Mol. Mass.:49830.54
Organism:Rattus norvegicus
Description:ChEMBL_143222
Residue:447
BDBM50287814
NameBDBM50287814
Synonyms:(S)-2-(3-Fluoro-phenoxymethyl)-1-methyl-pyrrolidine | CHEMBL74249
TypeSmall organic molecule
Emp. Form.C12H16FNO
Mol. Mass.209.2599
SMILESCN1CCC[C@H]1COc1cccc(F)c1