Reaction Details
TargetLeukotriene B4 receptor 1
LigandBDBM50084106
Substrate/Competitorn/a
Meas. Tech.ChEMBL_98509 (CHEMBL709171)
IC50 70000±n/a nM
Citation Poudrel, JMHullot, PVidal, JPGirard, JPRossi, JCMuller, ABonne, C Synthesis and pharmacological profile of new 1,3-disubstituted cyclohexanes as leukotriene B4 receptor antagonists Bioorg Med Chem Lett6:2349-2354 (1996)    Article
 
Leukotriene B4 receptor 1
Name:Leukotriene B4 receptor 1
Type:Enzyme Catalytic Domain
Mol. Mass.:37582.68
Organism:Homo sapiens (Human)
Description:Q15722
Residue:352
BDBM50084106
NameBDBM50084106
Synonyms:CHEMBL77513 | Sodium; [(1S,3S)-1-hydroxy-3-((E)-3-hydroxy-7-phenyl-hept-1-enyl)-cyclohexyl]-acetate
TypeSmall organic molecule
Emp. Form.C21H29O4
Mol. Mass.345.4531
SMILESOC(CCCCc1ccccc1)\C=C\[C@H]1CCC[C@@](O)(CC([O-])=O)C1