Reaction Details
TargetMu-type opioid receptor
LigandBDBM50248793
Substrate/Competitorn/a
Meas. Tech.ChEBML_138744
Ki 0.070000±n/a nM
Citation Derrick, IMoynihan, HABroadbear, JWoods, JHLewis, JW 6N-Cinnamoyl-β-naltrexamine and its p-nitro derivative. High efficacy κ-opioid agonists with weak antagonist actions Bioorg Med Chem Lett6:167-172 (1996)    Article
 
Mu-type opioid receptor
Name:Mu-type opioid receptor
Type:Enzyme Catalytic Domain
Mol. Mass.:11165.58
Organism:GUINEA PIG
Description:P97266
Residue:98
BDBM50248793
NameBDBM50248793
Synonyms:17-Cyclopropylmethyl-3,14beta-dihydroxy-4,5alpha-epoxy-6beta-(cinnamoylamino)morphinan | CHEMBL473362
TypeSmall organic molecule
Emp. Form.C29H32N2O4
Mol. Mass.472.5754
SMILESOc1ccc2C[C@H]3N(CC4CC4)CC[C@@]45[C@@H](Oc1c24)[C@@H](CC[C@@]35O)NC(=O)\C=C\c1ccccc1