Reaction Details
TargetCannabinoid receptor 1
LigandBDBM50287931
Substrate/Competitorn/a
Meas. Tech.ChEBML_46461
Ki>20000±n/a nM
Citation Gareau, YDufresne, CGallant, MRochette, CSawyer, NSlipetz, DMTremblay, NWeech, PKMetters, KMLabelle, M Structure activity relationships of tetrahydrocannabinol analogues on human cannabinoid receptors Bioorg Med Chem Lett6:189-194 (1996)    Article
 
Cannabinoid receptor 1
Name:Cannabinoid receptor 1
Type:G Protein-Coupled Receptor (GPCR)
Mol. Mass.:52868.96
Organism:Homo sapiens (Human)
Description:P21554
Residue:472
BDBM50287931
NameBDBM50287931
Synonyms:4-(1,1-Dimethyl-heptyl)-2,6-dimethoxy-3',5'-dimethyl-biphenyl | CHEMBL61037
TypeSmall organic molecule
Emp. Form.C25H36O2
Mol. Mass.368.5521
SMILESCCCCCCC(C)(C)c1cc(OC)c(c(OC)c1)-c1cc(C)cc(C)c1