Reaction Details
TargetCannabinoid receptor 1
LigandBDBM50287935
Substrate/Competitorn/a
Meas. Tech.ChEBML_46461
Ki 79±n/a nM
Citation Gareau, YDufresne, CGallant, MRochette, CSawyer, NSlipetz, DMTremblay, NWeech, PKMetters, KMLabelle, M Structure activity relationships of tetrahydrocannabinol analogues on human cannabinoid receptors Bioorg Med Chem Lett6:189-194 (1996)    Article
 
Cannabinoid receptor 1
Name:Cannabinoid receptor 1
Type:G Protein-Coupled Receptor (GPCR)
Mol. Mass.:52868.96
Organism:Homo sapiens (Human)
Description:P21554
Residue:472
BDBM50287935
NameBDBM50287935
Synonyms:4-(1,1-Dimethyl-heptyl)-3',5'-dimethyl-biphenyl-2,6-diol | CHEMBL56288
TypeSmall organic molecule
Emp. Form.C23H32O2
Mol. Mass.340.499
SMILESCCCCCCC(C)(C)c1cc(O)c(c(O)c1)-c1cc(C)cc(C)c1