Reaction Details
TargetCannabinoid receptor 1
LigandBDBM50287937
Substrate/Competitorn/a
Meas. Tech.ChEBML_46461
Ki 350±n/a nM
Citation Gareau, YDufresne, CGallant, MRochette, CSawyer, NSlipetz, DMTremblay, NWeech, PKMetters, KMLabelle, M Structure activity relationships of tetrahydrocannabinol analogues on human cannabinoid receptors Bioorg Med Chem Lett6:189-194 (1996)    Article
 
Cannabinoid receptor 1
Name:Cannabinoid receptor 1
Type:G Protein-Coupled Receptor (GPCR)
Mol. Mass.:52868.96
Organism:Homo sapiens (Human)
Description:P21554
Residue:472
BDBM50287937
NameBDBM50287937
Synonyms:5-(1,1-Dimethyl-heptyl)-2-((R)-4,6,6-trimethyl-bicyclo[3.1.1]hept-3-en-2-yl)-benzene-1,3-diol | CHEMBL57840
TypeSmall organic molecule
Emp. Form.C25H38O2
Mol. Mass.370.568
SMILESCCCCCCC(C)(C)c1cc(O)c([C@@H]2C=C(C)C3C[C@H]2C3(C)C)c(O)c1