Reaction Details
TargetCannabinoid receptor 2
LigandBDBM50287933
Substrate/Competitorn/a
Meas. Tech.ChEBML_46992
Ki 21±n/a nM
Citation Gareau, YDufresne, CGallant, MRochette, CSawyer, NSlipetz, DMTremblay, NWeech, PKMetters, KMLabelle, M Structure activity relationships of tetrahydrocannabinol analogues on human cannabinoid receptors Bioorg Med Chem Lett6:189-194 (1996)    Article
 
Cannabinoid receptor 2
Name:Cannabinoid receptor 2
Type:G Protein-Coupled Receptor (GPCR)
Mol. Mass.:39690.94
Organism:Homo sapiens (Human)
Description:P34972
Residue:360
BDBM50287933
NameBDBM50287933
Synonyms:(6aR,10aR)-3-(1,1-Dimethyl-heptyl)-6,6,9-trimethyl-6a,7,10,10a-tetrahydro-6H-benzo[c]chromene | CHEMBL57723
TypeSmall organic molecule
Emp. Form.C25H38O
Mol. Mass.354.5686
SMILESCCCCCCC(C)(C)c1ccc2[C@@H]3CC(C)=CC[C@H]3C(C)(C)Oc2c1