Reaction Details
TargetDipeptidyl peptidase 4
LigandBDBM50288298
Substrate/Competitorn/a
Meas. Tech.ChEBML_53349
Ki 1.7±n/a nM
Citation Ashworth, DMAtrash, BBaker, GRBaxter, AJJenkins, PDJones, DMSzelke, M 4-cyanothiazolidides as very potent, stable inhibitors of dipeptidyl peptidase IV Bioorg Med Chem Lett6:2745-2748 (1996)    Article
 
Dipeptidyl peptidase 4
Name:Dipeptidyl peptidase 4
Type:Enzyme
Mol. Mass.:88271.01
Organism:Homo sapiens (Human)
Description:P27487
Residue:766
BDBM50288298
NameBDBM50288298
Synonyms:(S)-3-((S)-2-Amino-3-methyl-pentanoyl)-thiazolidine-2-carbonitrile | CHEMBL327187
TypeSmall organic molecule
Emp. Form.C10H17N3OS
Mol. Mass.227.326
SMILESCCC(C)[C@H](N)C(=O)N1CCS[C@H]1C#N