Reaction Details
TargetChymotrypsin-like protease CTRL-1
LigandBDBM50288610
Substrate/Competitorn/a
Meas. Tech.ChEBML_49606
IC50>1000±n/a nM
Citation Iqbal, MChatterjee, SKauer, JCMallamo, JPMessina, PAReiboldt, ASiman, R Potent α-ketocarbonyl and boronic ester derived inhibitors of proteasome Bioorg Med Chem Lett6:287-290 (1996)    Article
 
Chymotrypsin-like protease CTRL-1
Name:Chymotrypsin-like protease CTRL-1
Type:PROTEIN
Mol. Mass.:28008.18
Organism:Homo sapiens (Human)
Description:ChEMBL_49606
Residue:264
BDBM50288610
NameBDBM50288610
Synonyms:Alpha-ketocarbonyl derivative | CHEMBL98937
TypeSmall organic molecule
Emp. Form.C29H50ClN7O5
Mol. Mass.612.204
SMILESCC(C)CC(NC(=O)C(CCCN=C(N)N[N+]([O-])=O)NC(=O)C(CCCCCCCCC#N)C1CCCC1)C(=O)CCl