Reaction Details
TargetStromelysin-1
LigandBDBM50288676
Substrate/Competitorn/a
Meas. Tech.ChEBML_102081
Ki 520±n/a nM
Citation Caldwell, CGSahoo, SPPolo, SAEversole, RRLanza, TJMills, SGNiedzwiecki, LMIzquierdo-Martin, MChang, BCHarrison, RKKuo, DWLin, TYStein, RLDurette, PLHagmann, WK Phosphinic acid inhibitors of matrix metalloproteinases Bioorg Med Chem Lett6:323-328 (1996)    Article
 
Stromelysin-1
Name:Stromelysin-1
Type:Enzyme
Mol. Mass.:53973.13
Organism:Homo sapiens (Human)
Description: P08254
Residue:477
BDBM50288676
NameBDBM50288676
Synonyms:3-{Hydroxy-[(S)-2-((S)-3-methyl-1-phenylcarbamoyl-butylcarbamoyl)-4-phenyl-butyl]-phosphinoyl}-propionic acid methyl ester | CHEMBL109358
TypeSmall organic molecule
Emp. Form.C27H37N2O6P
Mol. Mass.516.5662
SMILESCOC(=O)CCP(O)(=O)C[C@@H](CCc1ccccc1)C(=O)N[C@@H](CC(C)C)C(=O)Nc1ccccc1