Reaction Details
Target72 kDa type IV collagenase
LigandBDBM50288678
Substrate/Competitorn/a
Meas. Tech.ChEBML_101916
Ki 7.3±n/a nM
Citation Caldwell, CGSahoo, SPPolo, SAEversole, RRLanza, TJMills, SGNiedzwiecki, LMIzquierdo-Martin, MChang, BCHarrison, RKKuo, DWLin, TYStein, RLDurette, PLHagmann, WK Phosphinic acid inhibitors of matrix metalloproteinases Bioorg Med Chem Lett6:323-328 (1996)    Article
 
72 kDa type IV collagenase
Name:72 kDa type IV collagenase
Type:Enzyme
Mol. Mass.:73870.36
Organism:Homo sapiens (Human)
Description: P08253
Residue:660
BDBM50288678
NameBDBM50288678
Synonyms:CHEMBL320968 | [(S)-2-((S)-3-Methyl-1-phenylcarbamoyl-butylcarbamoyl)-4-phenyl-butyl]-[4-(1-oxo-1,3-dihydro-isoindol-2-yl)-butyl]-phosphinic acid
TypeSmall organic molecule
Emp. Form.C35H44N3O5P
Mol. Mass.617.7147
SMILESCC(C)C[C@H](NC(=O)[C@H](CCc1ccccc1)CP(O)(=O)CCCCN1Cc2ccccc2C1=O)C(=O)Nc1ccccc1