Reaction Details
TargetStromelysin-1
LigandBDBM50288696
Substrate/Competitorn/a
Meas. Tech.ChEBML_102081
Ki 470±n/a nM
Citation Caldwell, CGSahoo, SPPolo, SAEversole, RRLanza, TJMills, SGNiedzwiecki, LMIzquierdo-Martin, MChang, BCHarrison, RKKuo, DWLin, TYStein, RLDurette, PLHagmann, WK Phosphinic acid inhibitors of matrix metalloproteinases Bioorg Med Chem Lett6:323-328 (1996)    Article
 
Stromelysin-1
Name:Stromelysin-1
Type:Enzyme
Mol. Mass.:53973.13
Organism:Homo sapiens (Human)
Description: P08254
Residue:477
BDBM50288696
NameBDBM50288696
Synonyms:CHEMBL110075 | [(S)-2-((S)-3-Methyl-1-phenylcarbamoyl-butylcarbamoyl)-4-phenyl-butyl]-(2-phenylcarbamoyl-ethyl)-phosphinic acid
TypeSmall organic molecule
Emp. Form.C32H40N3O5P
Mol. Mass.577.6509
SMILESCC(C)C[C@H](NC(=O)[C@H](CCc1ccccc1)CP(O)(=O)CCC(=O)Nc1ccccc1)C(=O)Nc1ccccc1