Reaction Details
TargetStromelysin-1
LigandBDBM50288697
Substrate/Competitorn/a
Meas. Tech.ChEMBL_102081 (CHEMBL715980)
Ki 540±n/a nM
Citation Caldwell, CGSahoo, SPPolo, SAEversole, RRLanza, TJMills, SGNiedzwiecki, LMIzquierdo-Martin, MChang, BCHarrison, RKKuo, DWLin, TYStein, RLDurette, PLHagmann, WK Phosphinic acid inhibitors of matrix metalloproteinases Bioorg Med Chem Lett6:323-328 (1996)    Article
 
Stromelysin-1
Name:Stromelysin-1
Type:Enzyme
Mol. Mass.:53973.13
Organism:Homo sapiens (Human)
Description: P08254
Residue:477
BDBM50288697
NameBDBM50288697
Synonyms:(2-Benzylcarbamoyl-ethyl)-[(S)-2-((S)-3-methyl-1-phenylcarbamoyl-butylcarbamoyl)-4-phenyl-butyl]-phosphinic acid | CHEMBL108275
TypeSmall organic molecule
Emp. Form.C33H42N3O5P
Mol. Mass.591.6774
SMILESCC(C)C[C@H](NC(=O)[C@H](CCc1ccccc1)CP(O)(=O)CCC(=O)NCc1ccccc1)C(=O)Nc1ccccc1