Reaction Details
TargetInterstitial collagenase
LigandBDBM50288702
Substrate/Competitorn/a
Meas. Tech.ChEBML_101755
Ki 720±n/a nM
Citation Chapman, KTWales, JSahoo, SPNiedzwiecki, LMIzquierdo-Martin, MChang, BCHarrison, RKStein, RLHagmann, WK Inhibition of matrix metalloproteinases by P1 substituted N-carboxyalkyl dipeptides Bioorg Med Chem Lett6:329-332 (1996)    Article
 
Interstitial collagenase
Name:Interstitial collagenase
Type:Enzyme
Mol. Mass.:54010.26
Organism:Homo sapiens (Human)
Description: P03956
Residue:469
BDBM50288702
NameBDBM50288702
Synonyms:(R)-6-(1,3-Dioxo-1,3-dihydro-isoindol-2-yl)-2-[(S)-1-((S)-3-methyl-1-phenylcarbamoyl-butylcarbamoyl)-3-phenyl-propylamino]-hexanoic acid CHEMBL112180
TypeSmall organic molecule
Emp. Form.C36H42N4O6
Mol. Mass.626.7419
SMILESCC(C)C[C@H](NC(=O)[C@H](CCc1ccccc1)N[C@H](CCCCN1C(=O)c2ccccc2C1=O)C(O)=O)C(=O)Nc1ccccc1