Reaction Details
TargetStromelysin-1
LigandBDBM50288708
Substrate/Competitorn/a
Meas. Tech.ChEBML_102083
Ki 12±n/a nM
Citation Chapman, KTWales, JSahoo, SPNiedzwiecki, LMIzquierdo-Martin, MChang, BCHarrison, RKStein, RLHagmann, WK Inhibition of matrix metalloproteinases by P1 substituted N-carboxyalkyl dipeptides Bioorg Med Chem Lett6:329-332 (1996)    Article
 
Stromelysin-1
Name:Stromelysin-1
Type:Enzyme
Mol. Mass.:53973.13
Organism:Homo sapiens (Human)
Description: P08254
Residue:477
BDBM50288708
NameBDBM50288708
Synonyms:(R)-2-[(S)-1-((S)-3-Methyl-1-phenylcarbamoyl-butylcarbamoyl)-3-phenyl-propylamino]-6-(1-oxo-1,3-dihydro-isoindol-2-yl)-hexanoic acid | CHEMBL112147
TypeSmall organic molecule
Emp. Form.C36H44N4O5
Mol. Mass.612.7584
SMILESCC(C)C[C@H](NC(=O)[C@H](CCc1ccccc1)N[C@H](CCCCN1Cc2ccccc2C1=O)C(O)=O)C(=O)Nc1ccccc1