Reaction Details
Target72 kDa type IV collagenase
LigandBDBM50288716
Substrate/Competitorn/a
Meas. Tech.ChEBML_101920
Ki 20±n/a nM
Citation Chapman, KTWales, JSahoo, SPNiedzwiecki, LMIzquierdo-Martin, MChang, BCHarrison, RKStein, RLHagmann, WK Inhibition of matrix metalloproteinases by P1 substituted N-carboxyalkyl dipeptides Bioorg Med Chem Lett6:329-332 (1996)    Article
 
72 kDa type IV collagenase
Name:72 kDa type IV collagenase
Type:Enzyme
Mol. Mass.:73870.36
Organism:Homo sapiens (Human)
Description: P08253
Residue:660
BDBM50288716
NameBDBM50288716
Synonyms:(R)-4-(1,3-Dioxo-1,3-dihydro-isoindol-2-yl)-2-[(S)-1-((S)-3-methyl-1-phenylcarbamoyl-butylcarbamoyl)-3-phenyl-propylamino]-butyric acid | CHEMBL111017
TypeSmall organic molecule
Emp. Form.C34H38N4O6
Mol. Mass.598.6887
SMILESCC(C)C[C@H](NC(=O)[C@H](CCc1ccccc1)N[C@H](CCN1C(=O)c2ccccc2C1=O)C(O)=O)C(=O)Nc1ccccc1