Reaction Details
TargetGag-Pol polyprotein [489-587]
LigandBDBM50036251
Substrate/Competitorn/a
Meas. Tech.ChEMBL_159618 (CHEMBL760099)
IC50 6±n/a nM
Citation Freskos, JNBertenshaw, DEGetman, DPHeintz, RMMischke, BVBlystone, LWBryant, MLFunckes-Shippy, CHouseman, KAKishore, NNKocan, GPMehta, PP (Hydroxyethyl) sulfonamide HIV-1 Protease inhibitors: Identification of the 2-methylbenzoyl moiety at P-2 Bioorg Med Chem Lett6:445-450 (1996)    Article
 
Gag-Pol polyprotein [489-587]
Name:Gag-Pol polyprotein [489-587]
Type:Enzyme Subunit
Mol. Mass.:10781.16
Organism:Human immunodeficiency virus type 1
Description:P04585[489-587]
Residue:99
BDBM50036251
NameBDBM50036251
Synonyms:CHEMBL141265 | [(1S,2R)-3-(Benzenesulfonyl-isobutyl-amino)-1-benzyl-2-hydroxy-propyl]-carbamic acid benzyl ester
TypeSmall organic molecule
Emp. Form.C28H34N2O5S
Mol. Mass.510.645
SMILESCC(C)CN(C[C@@H](O)[C@H](Cc1ccccc1)NC(=O)OCc1ccccc1)S(=O)(=O)c1ccccc1