Reaction Details
Target3-oxo-5-alpha-steroid 4-dehydrogenase 2
LigandBDBM50403607
Substrate/Competitorn/a
Meas. Tech.ChEBML_202913
Ki 10000±n/a nM
Citation Abell, ADBrandt, MLevy, MAHolt, DA A comparison of steroidal and non-steroidal inhibitors of human steroid 5α-reductase: New tricyclic aryl acid inhibitors of the type-1 isozyme Bioorg Med Chem Lett6:481-484 (1996)    Article
 
3-oxo-5-alpha-steroid 4-dehydrogenase 2
Name:3-oxo-5-alpha-steroid 4-dehydrogenase 2
Type:Enzyme
Mol. Mass.:28406.59
Organism:Homo sapiens (Human)
Description:P31213
Residue:254
BDBM50403607
NameBDBM50403607
Synonyms:CHEMBL341625
TypeSmall organic molecule
Emp. Form.C15H12O2
Mol. Mass.224.2546
SMILESOC(=O)c1ccc-2c(CCc3ccccc-23)c1