Reaction Details
Target3-oxo-5-alpha-steroid 4-dehydrogenase 1
LigandBDBM50057501
Substrate/Competitorn/a
Meas. Tech.ChEBML_202904
Ki 1200±n/a nM
Citation Abell, ADBrandt, MLevy, MAHolt, DA A comparison of steroidal and non-steroidal inhibitors of human steroid 5α-reductase: New tricyclic aryl acid inhibitors of the type-1 isozyme Bioorg Med Chem Lett6:481-484 (1996)    Article
 
3-oxo-5-alpha-steroid 4-dehydrogenase 1
Name:3-oxo-5-alpha-steroid 4-dehydrogenase 1
Type:Enzyme
Mol. Mass.:29472.80
Organism:Homo sapiens (Human)
Description:P18405
Residue:259
BDBM50057501
NameBDBM50057501
Synonyms:(S)-7-Chloro-4a-methyl-3,4,4a,9-tetrahydro-phenanthrene-2-carboxylic acid | CHEMBL25081
TypeSmall organic molecule
Emp. Form.C16H15ClO2
Mol. Mass.274.742
SMILESC[C@]12CCC(=CC1=CCc1cc(Cl)ccc21)C(O)=O