Reaction Details
Target3-oxo-5-alpha-steroid 4-dehydrogenase 2
LigandBDBM50403611
Substrate/Competitorn/a
Meas. Tech.ChEBML_202913
Ki 2500±n/a nM
Citation Abell, ADBrandt, MLevy, MAHolt, DA A comparison of steroidal and non-steroidal inhibitors of human steroid 5α-reductase: New tricyclic aryl acid inhibitors of the type-1 isozyme Bioorg Med Chem Lett6:481-484 (1996)    Article
 
3-oxo-5-alpha-steroid 4-dehydrogenase 2
Name:3-oxo-5-alpha-steroid 4-dehydrogenase 2
Type:Enzyme
Mol. Mass.:28406.59
Organism:Homo sapiens (Human)
Description:P31213
Residue:254
BDBM50403611
NameBDBM50403611
Synonyms:CHEMBL356780
TypeSmall organic molecule
Emp. Form.C15H11ClO2
Mol. Mass.258.7
SMILESOC(=O)c1ccc-2c(CCc3cc(Cl)ccc-23)c1