Reaction Details
TargetStromelysin-1
LigandBDBM50289123
Substrate/Competitorn/a
Meas. Tech.ChEBML_102093
Ki 9.5±n/a nM
Citation Chapman, KTDurette, PLCaldwell, CGSperow, KMNiedzwiecki, LMHarrison, RKSaphos, CChristen, AJOlszewski, JMMoore, VLMacCoss, MHagmann, WK Orally active inhibitors of stromelysin-1 (MMP-3) Bioorg Med Chem Lett6:803-806 (1996)    Article
 
Stromelysin-1
Name:Stromelysin-1
Type:Enzyme
Mol. Mass.:53973.13
Organism:Homo sapiens (Human)
Description: P08254
Residue:477
BDBM50289123
NameBDBM50289123
Synonyms:(R)-2-[(S)-1-(3-Methyl-1-phenylcarbamoyl-butylcarbamoyl)-3-(4-propyl-phenyl)-propylamino]-6-(1-oxo-1,3-dihydro-isoindol-2-yl)-hexanoic acid | CHEMBL267536
TypeSmall organic molecule
Emp. Form.C39H50N4O5
Mol. Mass.654.8381
SMILESCCCc1ccc(CC[C@H](N[C@H](CCCCN2Cc3ccccc3C2=O)C(O)=O)C(=O)N[C@@H](CC(C)C)C(=O)Nc2ccccc2)cc1