Reaction Details
Target72 kDa type IV collagenase
LigandBDBM50057083
Substrate/Competitorn/a
Meas. Tech.ChEBML_101928
Ki 200±n/a nM
Citation Chapman, KTDurette, PLCaldwell, CGSperow, KMNiedzwiecki, LMHarrison, RKSaphos, CChristen, AJOlszewski, JMMoore, VLMacCoss, MHagmann, WK Orally active inhibitors of stromelysin-1 (MMP-3) Bioorg Med Chem Lett6:803-806 (1996)    Article
 
72 kDa type IV collagenase
Name:72 kDa type IV collagenase
Type:Enzyme
Mol. Mass.:73870.36
Organism:Homo sapiens (Human)
Description: P08253
Residue:660
BDBM50057083
NameBDBM50057083
Synonyms:(R)-2-((S)-1-((S)-4-methyl-1-oxo-1-(phenylamino)pentan-2-ylamino)-1-oxo-4-phenylbutan-2-ylamino)propanoic acid (R)-2-[(S)-1-(3-Methyl-1-phenylcarbamoyl-butylcarbamoyl)-3-phenyl-propylamino]-propionic acid L-696418
TypeSmall organic molecule
Emp. Form.C25H33N3O4
Mol. Mass.439.5472
SMILESCC(C)C[C@H](NC(=O)[C@H](CCc1ccccc1)N[C@H](C)C(O)=O)C(=O)Nc1ccccc1