Reaction Details
TargetNeprilysin
LigandBDBM50281462
Substrate/Competitorn/a
Meas. Tech.ChEBML_144622
Ki 330±n/a nM
Citation Warshawsky, AMFlynn, GAKoehl, JRMehdi, SVaz, RJ The synthesis of aminobenzazepinones as anti-phenylalanine dipeptide mimics and their use in nep inhibition Bioorg Med Chem Lett6:957-962 (1996)    Article
 
Neprilysin
Name:Neprilysin
Type:Protein
Mol. Mass.:85789.59
Organism:Rattus norvegicus (Rat)
Description:P07861
Residue:750
BDBM50281462
NameBDBM50281462
Synonyms:(R)-2-[(6S,7S)-6-((R)-2-Mercapto-3-phenyl-propionylamino)-5-oxo-7-phenyl-[1,4]oxazepan-4-yl]-4-methyl-pentanoic acid CHEMBL311838 | MDL-100192
TypeSmall organic molecule
Emp. Form.C26H32N2O5S
Mol. Mass.484.608
SMILESCC(C)C[C@@H](N1CCO[C@H]([C@H](NC(=O)[C@H](S)Cc2ccccc2)C1=O)c1ccccc1)C(O)=O