Reaction Details
TargetProstaglandin G/H synthase 1
LigandBDBM50289331
Substrate/Competitorn/a
Meas. Tech.ChEBML_158936
IC50 8500±n/a nM
Citation Roy, PLeblanc, YBall, RGBrideau, CChan, CCChauret, NCromlish, WEthier, DGauthier, JYGordon, RGreig, GGuay, JKargman, SLau, CKO'Neill, GSilva, JThérien, MStaden, CvWong, EXu, L A new series of selective COX-2 inhibitors: 5,6-diarylthiazolo[3,2-b][1,2,4]triazoles Bioorg Med Chem Lett7:57-62 (1997)    Article
 
Prostaglandin G/H synthase 1
Name:Prostaglandin G/H synthase 1
Type:Enzyme
Mol. Mass.:68692.62
Organism:Homo sapiens (Human)
Description:P23219
Residue:599
BDBM50289331
NameBDBM50289331
Synonyms:6-(3-Fluoro-phenyl)-5-(4-methanesulfonyl-phenyl)-2-trifluoromethyl-thiazolo[3,2-b][1,2,4]triazole | CHEMBL155927
TypeSmall organic molecule
Emp. Form.C18H11F4N3O2S2
Mol. Mass.441.422
SMILESCS(=O)(=O)c1ccc(cc1)-c1sc2nc(nn2c1-c1cccc(F)c1)C(F)(F)F