Reaction Details
TargetProstaglandin G/H synthase 2
LigandBDBM50289319
Substrate/Competitorn/a
Meas. Tech.ChEBML_159894
IC50 20±n/a nM
Citation Roy, PLeblanc, YBall, RGBrideau, CChan, CCChauret, NCromlish, WEthier, DGauthier, JYGordon, RGreig, GGuay, JKargman, SLau, CKO'Neill, GSilva, JThérien, MStaden, CvWong, EXu, L A new series of selective COX-2 inhibitors: 5,6-diarylthiazolo[3,2-b][1,2,4]triazoles Bioorg Med Chem Lett7:57-62 (1997)    Article
 
Prostaglandin G/H synthase 2
Name:Prostaglandin G/H synthase 2
Type:Enzyme
Mol. Mass.:69003.89
Organism:Homo sapiens (Human)
Description:Recombinant Cox-2 provided by Cayman (Cayman Chemical Co.,Ann Arbor, MI).
Residue:604
BDBM50289319
NameBDBM50289319
Synonyms:5-(4-Methanesulfonyl-phenyl)-2-methyl-6-phenyl-thiazolo[3,2-b][1,2,4]triazole | CHEMBL348087
TypeSmall organic molecule
Emp. Form.C18H15N3O2S2
Mol. Mass.369.461
SMILESCc1nc2sc(c(-c3ccccc3)n2n1)-c1ccc(cc1)S(C)(=O)=O