Reaction Details
TargetSigma non-opioid intracellular receptor 1
LigandBDBM50289541
Substrate/Competitorn/a
Meas. Tech.ChEBML_201293
IC50 4±n/a nM
Citation Mantegani, SBrambilla, ECremonesi, PCaccia, CFornaretto, MGCarfagna, NColombo, MMcArthur, RAVarasi, M (E) and (Z)-3-Styrylpiperidines as sigma ligands Bioorg Med Chem Lett7:1525-1530 (1997)    Article
 
Sigma non-opioid intracellular receptor 1
Name:Sigma non-opioid intracellular receptor 1
Type:Enzyme Catalytic Domain
Mol. Mass.:25266.54
Organism:RAT
Description:Q9R0C9
Residue:223
BDBM50289541
NameBDBM50289541
Synonyms:1-(3-Phenyl-propyl)-3-((E)-styryl)-piperidine | CHEMBL37661
TypeSmall organic molecule
Emp. Form.C22H27N
Mol. Mass.305.4565
SMILESC(CN1CCCC(C1)\C=C\c1ccccc1)Cc1ccccc1