Reaction Details
TargetProthrombin
LigandBDBM50289562
Substrate/Competitorn/a
Meas. Tech.ChEMBL_208919 (CHEMBL813201)
Ki 15±n/a nM
Citation Préville, PHe, JXTarazi, MSiddiqui, MACody, WLDoherty, AM An efficient preparation of the potent and selective pseudopeptide thrombin inhibitor, inogatran Bioorg Med Chem Lett7:1563-1566 (1997)    Article
 
Prothrombin
Name:Prothrombin
Type:Protein
Mol. Mass.:70029.57
Organism:Homo sapiens (Human)
Description:P00734
Residue:622
BDBM50289562
NameBDBM50289562
Synonyms:CHEMBL3216390 {(R)-1-Cyclohexylmethyl-2-[(S)-2-(3-guanidino-propylcarbamoyl)-piperidin-1-yl]-2-oxo-ethylamino}-acetic acid; dihydrochloride
TypeSmall organic molecule
Emp. Form.C21H40Cl2N6O4
Mol. Mass.511.486
SMILESCl.Cl.NC(=N)NCCCNC(=O)[C@@H]1CCCCN1C(=O)[C@@H](CC1CCCCC1)NCC(O)=O