Reaction Details
TargetNitric oxide synthase, brain
LigandBDBM50072297
Substrate/Competitorn/a
Meas. Tech.ChEBML_143378
Ki 230±n/a nM
Citation Shearer, BGLee, SFranzmann, KWWhite, HASanders, DCKiff, RJGarvey, EPFurfine, ES Conformationally restricted arginine analogues as inhibitors of human nitric oxide synthase Bioorg Med Chem Lett7:1763-1768 (1997)    Article
 
Nitric oxide synthase, brain
Name:Nitric oxide synthase, brain
Type:Homodimer
Mol. Mass.:160985.98
Organism:Homo sapiens (Human)
Description:P29475
Residue:1434
BDBM50072297
NameBDBM50072297
Synonyms:(S)-5-Acetimidoylamino-2-amino-pent 5-Acetimidoylamino-2-(S)-amino-pentanoic acid L-NIO, 12 N5-IMINOETHYL-L-ORNITHINE
TypeSmall organic molecule
Emp. Form.C7H15N3O2
Mol. Mass.173.2129
SMILESCC(N)=NCCC[C@H](N)C(O)=O