Reaction Details
TargetPeptidylprolyl isomerase
LigandBDBM50068591
Substrate/Competitorn/a
Meas. Tech.ChEBML_66431
Ki 24±n/a nM
Citation Hamilton, GSHuang, WConnolly, MARoss, DTGuo, HValentine, HLSuzdak, PDSteiner, JP FKBP12-binding domain analogues of FK506 are potent, nonimmunosuppressive neurotrophic agents in vitro and promote recovery in a mouse model of parkinson's disease Bioorg Med Chem Lett7:1785-1790 (1997)    Article
 
Peptidylprolyl isomerase
Name:Peptidylprolyl isomerase
Synonyms:FK506 binding protein 12
Type:PROTEIN
Mol. Mass.:11960.67
Organism:Gallus gallus
Description:ChEMBL_66431
Residue:108
BDBM50068591
NameBDBM50068591
TypeSmall organic molecule
Emp. Form.C23H33NO5
Mol. Mass.403.5118
SMILESCOc1ccc(CCCCOC(=O)C2CCCCN2C(=O)C(=O)C(C)(C)C)cc1