Reaction Details
TargetPeptidylprolyl isomerase
LigandBDBM50068582
Substrate/Competitorn/a
Meas. Tech.ChEBML_66431
Ki 5±n/a nM
Citation Hamilton, GSHuang, WConnolly, MARoss, DTGuo, HValentine, HLSuzdak, PDSteiner, JP FKBP12-binding domain analogues of FK506 are potent, nonimmunosuppressive neurotrophic agents in vitro and promote recovery in a mouse model of parkinson's disease Bioorg Med Chem Lett7:1785-1790 (1997)    Article
 
Peptidylprolyl isomerase
Name:Peptidylprolyl isomerase
Synonyms:FK506 binding protein 12
Type:PROTEIN
Mol. Mass.:11960.67
Organism:Gallus gallus
Description:ChEMBL_66431
Residue:108
BDBM50068582
NameBDBM50068582
TypeSmall organic molecule
Emp. Form.C31H41NO4
Mol. Mass.491.6615
SMILESCC(C)(C)C(=O)C(=O)N1CCCCC1C(=O)OC(CCCc1ccccc1)CCCc1ccccc1