Reaction Details
TargetPeptidylprolyl isomerase
LigandBDBM50068610
Substrate/Competitorn/a
Meas. Tech.ChEBML_66431
Ki 8.3±n/a nM
Citation Hamilton, GSHuang, WConnolly, MARoss, DTGuo, HValentine, HLSuzdak, PDSteiner, JP FKBP12-binding domain analogues of FK506 are potent, nonimmunosuppressive neurotrophic agents in vitro and promote recovery in a mouse model of parkinson's disease Bioorg Med Chem Lett7:1785-1790 (1997)    Article
 
Peptidylprolyl isomerase
Name:Peptidylprolyl isomerase
Synonyms:FK506 binding protein 12
Type:PROTEIN
Mol. Mass.:11960.67
Organism:Gallus gallus
Description:ChEMBL_66431
Residue:108
BDBM50068610
NameBDBM50068610
TypeSmall organic molecule
Emp. Form.C28H35NO4
Mol. Mass.449.5818
SMILESCCC(C)(C)C(=O)C(=O)N1CCCCC1C(=O)OCCC(c1ccccc1)c1ccccc1