Reaction Details
TargetSubstance-P receptor
LigandBDBM50214734
Substrate/Competitorn/a
Meas. Tech.ChEMBL_143040 (CHEMBL750289)
Ki 631±n/a nM
Citation Armour, DRAston, NMMorriss, KMCongreve, MSHawcock, ABMarquess, DMordaunt, JERichards, SAWard, P 1,4-Benzodiazepin-2-one derived neurokinin-1 receptor antagonists Bioorg Med Chem Lett7:2037-2042 (1997)    Article
 
Substance-P receptor
Name:Substance-P receptor
Type:G Protein-Coupled Receptor (GPCR)
Mol. Mass.:46254.43
Organism:Homo sapiens (Human)
Description:P25103
Residue:407
BDBM50214734
NameBDBM50214734
Synonyms:CHEMBL302163
TypeSmall organic molecule
Emp. Form.C25H19F6N3O2
Mol. Mass.507.4277
SMILESFC(F)(F)c1cc(CNC(=O)N2CC(=O)Nc3ccccc3C2c2ccccc2)cc(c1)C(F)(F)F